{"text_format":"1","workbook":"xlsx","n_sheets":7,"sheets":["LICENSE","REPORT","TRADUZIONI_LICENSE","TRADUZIONI","DATA","IMMAGINI","INFO VERS."],"not_rendered":{"charts":0,"images":38,"macros":1,"external_links":1,"defined_names":22,"comments":3,"pivot_tables":0},"unopened":[],"bounds":{"document_bytes":16777216,"sheet_cells":100000,"rows_first":2000,"rows_last":500,"rows_between":2000,"halvings":0,"cell_chars":16384,"cell_head_chars":4096},"cells_cut":0,"cells_raw":0,"read":"whole","date_system":"1900"}

{"sheet":"LICENSE","index":0,"n_rows":39,"n_cols":5,"rows_kept":39,"cut":false,"hidden":false,"merged":[[2,4,3,4],[4,2,4,5],[5,2,7,5],[9,2,9,5],[10,2,10,5],[19,2,19,5],[20,2,20,5],[21,2,21,5],[22,2,22,5],[11,2,11,5],[12,2,12,5],[13,2,13,5],[14,2,14,5],[15,2,15,5],[16,2,16,5],[34,2,34,5],[38,2,40,5],[2,3,3,3],[29,2,29,5],[30,2,30,5],[31,2,31,5],[32,2,32,5],[33,2,33,5],[23,2,23,5],[24,2,24,5],[25,2,25,5],[26,2,26,5],[27,2,27,5],[28,2,28,5],[17,2,17,5],[18,2,18,5]]}
[]
[99,null,null,"GWZ_calculator",{"$f":"INDEX(TRADUZIONI!$A$2:$H$193,1,$A$5)","v":"Lingua"}]
[null,null,null,"vers.1.02","IT"]
[{"$f":"INDEX(TRADUZIONI!$A$1:$R$149,1,A5)","v":"Italiano"}]
[{"$f":"MATCH($E$3,DATA!$B$3:$B$8,)+2","v":3},null,"GWZ CALCULATOR"]
[1,null,{"$f":"INDEX(TRADUZIONI_LICENSE!$A$2:$H$41,A6,$A$5)","v":"CONDIZIONI GENERALI CONTRATTO DI LICENZA D’USO PER IL FOGLIO DI CALCOLO \"GWZ_CALCULATOR\""}]
[]
[]
{"$rows_left_out":32}
{"sheet":"REPORT","index":1,"n_rows":218,"n_cols":25,"rows_kept":218,"cut":false,"hidden":false,"merged":[[54,1,55,1],[56,3,56,4],[215,6,215,7],[171,3,171,4],[181,3,181,6],[182,3,182,6],[179,7,182,7],[162,6,162,7],[163,6,163,7],[215,4,215,5],[203,3,203,4],[190,3,190,4],[179,3,180,6],[205,3,205,4],[206,3,206,4],[192,3,192,4],[193,3,193,4],[204,3,204,4],[199,3,200,7],[191,3,191,4],[163,3,164,3],[208,3,212,7],[151,5,151,6],[138,5,138,6],[160,18,162,18],[145,3,145,4],[145,5,145,6],[137,3,137,4],[150,3,150,4],[159,3,159,6],[51,3,51,5],[51,6,51,7],[52,6,52,7],[53,6,53,7],[53,3,53,4],[52,3,52,4],[160,17,162,17],[70,3,70,7],[57,3,57,4],[116,3,116,7],[89,3,89,7],[112,3,112,4],[69,3,69,6],[85,3,85,4],[114,3,114,4],[156,3,156,4],[157,3,157,4],[157,5,157,6],[27,6,27,7],[138,3,138,4],[140,3,140,7],[124,3,124,6],[28,6,28,7],[28,4,28,5],[34,3,34,4],[35,3,35,4],[45,3,45,7],[37,3,37,4],[38,3,38,4],[39,3,39,4],[40,3,40,4],[42,3,42,4],[41,3,41,4],[27,3,27,5],[2,3,3,3],[5,3,6,7],[2,5,3,5],[25,3,25,5],[26,3,26,5],[3,6,3,7],[2,6,2,7],[25,6,25,7],[26,6,26,7],[8,6,8,7],[9,6,9,7],[10,6,10,7],[22,3,22,6],[24,3,24,5],[12,6,13,7],[17,4,17,5],[17,6,17,7],[90,12,93,12],[90,13,93,13],[90,14,93,14],[32,3,32,4],[33,3,33,4],[30,3,30,7],[161,3,162,3],[126,3,126,6],[127,3,127,7],[132,5,132,6],[132,3,132,4],[131,3,131,4],[31,3,31,4],[50,6,50,7],[49,3,49,7],[47,3,47,4],[56,5,56,6],[57,5,57,6],[161,5,161,7],[144,3,144,4],[50,4,50,5],[151,3,151,4],[113,5,113,6],[123,3,123,4]]}
[]
[null,null,null,null,null,{"$f":"UPPER(INDEX(TRADUZIONI!$A$2:$H$298,1,REPORT!$A$4))","v":"LINGUA"}]
[{"$f":"INDEX(TRADUZIONI!$A$1:$H$222,1,REPORT!$A$4)","v":"Italiano"},null,null,null,null,{"$f":"LICENSE!E3","v":"IT"},{"$f":"LICENSE!D2","v":"GWZ_calculator"}]
[{"$f":"MATCH($F$3,DATA!$B$3:$B$8,)+2","v":3},null,null,null,null,null,{"$f":"LICENSE!D3","v":"vers.1.02"}]
[]
[null,2,null,{"$f":"INDEX(TRADUZIONI!$A$2:$H$193,REPORT!B6,REPORT!$A$4)","v":"GIUNZIONE TRAVE PRINCIPALE - TRAVE SECONDARIA CON CONNETTORI INCROCIATI GWZ"}]
[]
[]
{"$rows_left_out":211}
{"sheet":"TRADUZIONI_LICENSE","index":2,"n_rows":28,"n_cols":8,"rows_kept":28,"cut":false,"hidden":true,"merged":[]}
["id ",null,"Italiano","English","Deutsch","Française","Español","Português"]
[1,null,"CONDIZIONI GENERALI CONTRATTO DI LICENZA D’USO PER IL FOGLIO DI CALCOLO \"GWZ_CALCULATOR\"","GENERAL TERMS AND CONDITIONS OF THE LICENSE AGREEMENT FOR THE USE OF THE SPREADSHEET \"GWZ_CALCULATOR\"","ALLGEMEINE BEDINGUNGEN DES LIZENZVERTRAGS ZUR NUTZUNG DES TABELLENKALKULATIONSPROGRAMMS \"GWZ_CALCULATOR\"","CONDITIONS GÉNÉRALES DU CONTRAT DE LICENCE D'UTILISATION DE LA FEUILLE DE CALCUL \"GWZ_CALCULATOR\"","CONDICIONES GENERALES DEL CONTRATO DE LICENCIA DE USO PARA LA HOJA DE CÁLCULO \"GWZ_CALCULATOR\"","CONDIÇÕES GERAIS DO CONTRATO DE LICENÇA PARA A UTILIZAÇÃO DA FOLHA DE CÁLCULO \"GWZ_CALCULATOR\""]
[2,null,"1. OGGETTO","1. SUBJECT","1. BETREFF","1. OBJET","1. OBJETO","1. OBJETO"]
[3,null,"\nCon le presenti Condizioni Generali (o “Contratto”), ROTHO BLAAS SRL, con sede in I-39040 Cortaccia (BZ), Via dell’Adige 2/1 (d’ora in avanti “RB”) concede all’utente il diritto non esclusivo e revocabile di utilizzare, a titolo gratuito, il foglio di calcolo (d’ora in avanti “CALC”) alle condizioni di seguito indicate e per la durata del presente Contratto.\n\nIl presente contratto regola pertanto il rapporto tra l’utente e RB relativamente all’utilizzo di detto foglio di calcolo. Nel momento in cui l’utente scarica e utilizza CALC, lo stesso accetta il presente Contratto e le condizioni riportate.\n\nCALC permette all’utente di effettuare calcoli statici esclusivamente per i prodotti e materiali indicati in ciascuna sezione dello stesso. Il presente Contratto vieta espressamente l’uso di CALC per la realizzazione di prodotti che non sono indicati.\n\nNessuna garanzia sulla conformità legale ed al progetto dei calcoli è in ogni caso fornita da RB, che intende fornire esclusivamente uno strumento di calcolo indicativo quale servizio tecnico-commerciale nell’ambito dell’attività di vendita.","\nWith these General Terms and Conditions (or \"Agreement\"), ROTHO BLAAS SRL, with registered office at I-39040 Cortaccia (BZ), Via dell'Adige 2/1 (hereinafter \"RB\") grants the user the non-exclusive and revocable right to use the spreadsheet (hereinafter \"XLS\") free of charge under the following conditions and during the term of this Agreement.\n\nIn any case, RB does not guarantee the legal and design conformity of the calculations, as RB intends to provide only an indicative calculation tool to be considered as a technical-commercial service within the sales activity.\n\nXLS allows the user to perform static calculations only for the products and materials indicated in each of its sections. This Agreement expressly prohibits to use XLS to manufacture products that are not indicated.\n\nThis Agreement therefore governs the relationship between the User and RB with respect to the use of this spreadsheet. By downloading and using XLS, the user accepts this Agreement and the conditions set out herein.","\nMit diesen Allgemeinen Bedingungen (oder „Vertrag“) gewährt ROTHO BLAAS SRL mit Sitz in I-39040 Kurtatsch (BZ), Etschweg 2/1 (nachfolgend „RB“) dem Benutzer das nicht exklusive und widerrufliche Recht, das Tabellenkalkulationsprogramm (nachfolgend „XLS“) zu den im Folgenden angegebenen Bedingungen und für die Laufzeit dieses Vertrags unentgeltlich zu verwenden.\n\nDieser Vertrag regelt somit das Verhältnis zwischen dem Benutzer und RB in Bezug auf die Verwendung des besagten Tabellenkalkulationsprogramms. Wenn der Benutzer XLS herunterlädt und verwendet, akzeptiert er diesen Vertrag und die dort aufgeführten Bedingungen.\n\nXLS ermöglicht dem Benutzer, ausschließlich für jene Produkte und Materialien statische Berechnungen vorzunehmen, die in jeder seiner Sektionen angegeben sind. Durch diesen Vertrag ist die Verwendung von XLS für die Fertigung nicht angegebener Produkte ausdrücklich untersagt.\n\nRB bietet keine Garantie für die rechtliche Konformität und die Konformität mit dem Berechnungsprojekt und bezweckt, ausschließlich ein indikatives Berechnungstool bereitzustellen, bei dem es sich um eine technisch-kommerzielle Leistung im Rahmen der Vertriebstätigkeit handelt.","\nAvec les présentes Conditions Générales (ou « Contrat »), ROTHO BLAAS SRL, dont le siège se situe I-39040 Cortaccia (BZ), Via dell'Adige 2/1 (ci-après « RB »), donne à l'utilisateur le droit non exclusif et révocable d'utiliser à titre gratuit la feuille de calcul «CTC_calculator» (ci-après « XLS »), aux conditions indiquées ci-après et pour la durée du présent Contrat.\nLe présent contrat régit ainsi le rapport entre l'utilisateur et RB concernant l'utilisation de la feuille de calcul mentionnée. Lorsque l'utilisateur télécharge et utilise XLS, il accepte le présent Contrat et les conditions indiquées.\n\nXLS permet à l'utilisateur de déterminer un nombre indicatif de connecteurs ; le nombre exact de connecteurs doit être défini par le concepteur responsable, qui doit vérifier l'exactitude des résultats issus du traitement des données insérées.\n\nRB ne donne aucune garantie sur la conformité des calculs à la réglementation et au projet et fournit exclusivement un outil de calcul indicatif en tant que service technico-commercial dans le cadre de l'activité de vente.","\nCon estas Condiciones Generales (o “Contrato”), ROTHO BLAAS SRL, con domicilio en I-39040 Cortaccia (BZ), Via dell'Adige 2/1 (en lo sucesivo, “RB”), otorga al usuario el derecho no exclusivo y revocable para usar, a título gratuito, la hoja de cálculo “CTC_calculator” (en lo sucesivo, “XLS”) en las condiciones indicadas a continuación y mientras esté vigente el Contrato.\n\nPor lo tanto, este contrato tiene por objeto regular la relación entre el usuario y RB con respecto al uso de dicha hoja de cálculo. En el momento en que el usuario descarga y usa XLS, acepta este Contrato y las condiciones indicadas.\n\nXLS permite al usuario realizar cálculos estáticos exclusivamente para los productos y los materiales indicados en cada una de sus secciones. Este Contrato prohíbe expresamente el uso de XLS para realizar cálculos para productos que no estén indicados.\n\nEn cualquier caso, RB no proporciona ninguna garantía sobre la conformidad legal ni con el proyecto de cálculos y solo pretende proporcionar una herramienta de cálculo indicativo, como servicio técnico-comercial en el ámbito de la actividad de ventas.","\nCom as presentes Condições Gerais (ou “Contrato”), a ROTHO BLAAS SRL, com sede em I-39040 Cortaccia (BZ), Via dell’Adige 2/1 (a seguir designada “RB”) concede ao Utilizador o direito não exclusivo e revogável de utilizar gratuitamente a folha de cálculo (a seguir designada “XLS”) nas condições a seguir indicadas e durante o período de vigência do presente Contrato.\n\nEste acordo rege, portanto, a relação entre o Utilizador e a RB no que diz respeito à utilização da referida folha de cálculo. Ao transferir e utilizar o XLS, o Utilizador aceita o presente Contrato e as Condições aqui estabelecidas.\n\nO XLS permite ao Utilizador efetuar cálculos estáticos apenas para os produtos e materiais indicados em cada secção do mesmo. O presente Contrato proíbe expressamente a utilização de XLS para o fabrico de produtos não indicados.\n\nA RB não garante, em caso algum, a conformidade legal e com a conceção dos cálculos, pretendendo fornecer apenas um instrumento de cálculo indicativo enquanto serviço técnico-comercial no âmbito das suas atividades de venda.\n "]
[4,null,"2. RIFERIMENTI TECNICO-NORMATIVI","2. TECHNICAL-STANDARDS REFERENCES","2. TECHNISCH-RECHTLICHE VERWEISE","2. RÉFÉRENCES TECHNIQUES ET RÉGLEMENTAIRES","2. REFERENCIAS TÉCNICAS Y NORMATIVAS","2. REFERÊNCIAS TÉCNICO-NORMATIVAS"]
[5,null,"\nRB ha svolto le verifiche secondo i riferimenti tecnico-normativi indicati nel foglio di calcolo stesso, ove previsti.\n","\nRB carried out the checks in accordance with the technical and regulatory references indicated in the spreadsheet itself, where applicable.\n","\nRB hat die Prüfungen, sofern vorgesehen, gemäß den technisch-rechtlichen Verweisen vorgenommen, die in der Tabellenkalkulation aufgeführt sind.\n","\nRB a effectué les vérifications selon les références techniques et réglementaires indiquées directement dans la feuille de calcul, si prévues.\n","\nRB ha efectuado las comprobaciones según las referencias técnicas y normativas indicadas en la misma hoja de cálculo cuando así proceda.","\nRB realizou as verificações de acordo com as referências técnicas e normativas indicadas na própria folha de cálculo, quando aplicável."]
[6,null,"3. DIRITTI E OBBLIGHI DI RB","3. RB RIGHTS AND OBLIGATIONS","3. RECHTE UND PFLICHTEN VON RB","3. DROITS ET OBLIGATIONS DE RB","3. DERECHOS Y OBLIGACIONES DE RB","3. DIREITOS E OBRIGAÇÕES DA RB"]
[7,null,"\nRB:\n\na) mette a disposizione dell’Utente CALC gratuitamente, così com’è;\n\nb) non fornisce all’utente alcun supporto tecnico per l’utilizzo di CALC;\n\nc) non garantisce la conformità di CALC alla normativa vigente né al progetto dei calcoli effettuati tramite lo stesso. In particolare, in seguito alla modifica delle disposizioni di pertinenza quali, per es. norme, omologazioni, ecc. il foglio di calcolo potrebbe diventare, in parte o per intero, non valido.\n\nd) pur riservandosi il diritto di aggiornare, rivedere e sviluppare CALC, non assume alcun obbligo nei confronti dell’utente di verificare, correggere, completare o aggiornare il foglio di calcolo e/o rendere disponibili allo stesso gli aggiornamenti effettuati.","\nRB:\n\na) makes available XLS to the User free of charge, as it is;\n\nb) does not provide the user with any technical support for using XLS;\n\nc) does not guarantee that XLS complies with the regulations in force or with the calculations design made using it. In particular, as a result of changes to the relevant provisions, such as standards, approvals, etc., the spreadsheet may become invalid in part or in full.\n\nd) while reserving the right to update, revise and develop XLS, RB does not assume any obligation towards the user to verify, correct, complete or update the spreadsheet and/or make the updates available to the user.\n","\nRB:\n\na) stellt dem Benutzer XLS kostenlos, wie besehen, zur Verfügung;\n\nb) bietet dem Benutzer keinerlei technischen Support für die Verwendung von XLS;\n\nc) gewährleistet weder die Konformität von XLS mit den geltenden Verordnungen noch mit dem Projekt der Berechnungen, die hiermit vorgenommen wurden. Insbesondere könnte das Tabellenkalkulationsprogramm infolge einer Änderung der relevanten Bestimmungen, wie z. B. Normen, Zulassungen usw., seine Gültigkeit teilweise oder vollständig verlieren.\n\nd) übernimmt, auch wenn das Unternehmen sich das Recht auf Aktualisierung, Korrektur und Entwicklung von XLS vorbehält, keinerlei Verpflichtung gegenüber dem Benutzer, das Tabellenkalkulationsprogramm zu prüfen, zu korrigieren, zu vervollständigen oder zu aktualisieren und/oder dieses mit den vorgenommenen Aktualisierungen auszustatten.","\nRB:\n\na) met CALC à disposition de l'utilisateur gratuitement, en l'état actuel ;\n\nb) ne fournit à l'utilisateur aucun support technique pour l'utilisation de CALC ;\n\nc) ne garantit pas la conformité de CALC à la réglementation en vigueur ni au projet des calculs effectués à l'aide de celui-ci. En particulier, suite à la modification des dispositions relatives, comme les normes, homologations, etc. la feuille de calcul pourrait devenir entièrement ou partiellement non valide ;\n\nd) tout en se réservant le droit de mettre à jour, revoir et développer CALC, ne prend aucune obligation envers l'utilisateur concernant la vérification, la correction, le complètement ou la mise à jour de la feuille de calcul et/ou la mise à disposition des mises à jour effectuées.\n","\nRB:\n\na) pone el XLS a disposición del usuario gratuitamente, tal como está;\n\nb) no proporciona al usuario asistencia técnica de ningún tipo para el uso de XLS;\n\nc) no garantiza la conformidad de XLS con la normativa vigente ni con el proyecto de cálculos realizados con este. En concreto, tras modificar las disposiciones pertinentes, como, por ejemplo, normas, homologaciones, etc., la hoja de cálculo puede dejar de ser válida, parcial o completamente.\n\nd) aunque se reserva el derecho de actualizar, revisar y desarrollar XLS, no asume ninguna obligación, ante el usuario, de comprobar, corregir, completar o actualizar la hoja de cálculo ni de poner a su disposición las actualizaciones realizadas.","\nRB:\n\na) coloca o XLS à disposição do Utilizador, gratuitamente, tal como está;\n\nb) não fornece ao Utilizador qualquer suporte técnico para a utilização do XLS;\n\nc) não garante que o XLS esteja em conformidade com as normas em vigor ou com a conceção dos cálculos efetuados através do mesmo. Em particular, na sequência de alterações nas disposições aplicáveis, tais como normas, homologações, etc., a folha de cálculo pode ficar total ou parcialmente inválida.\n\nd) embora se reserve o direito de atualizar, rever e desenvolver o XLS, não assume qualquer obrigação perante o utilizar de verificar, corrigir, completar ou atualizar a folha de cálculo e/ou disponibilizar ao utilizar as atualizações realizadas."]
{"$rows_left_out":21}
{"sheet":"TRADUZIONI","index":3,"n_rows":229,"n_cols":10,"rows_kept":229,"cut":false,"hidden":true,"merged":[]}
["id ",null,"Italiano","English","Deutsch","Française","Español","Português"]
[1,null,"Lingua","Language","Sprache","Langue","Lengua","Língua"]
[2,null,"GIUNZIONE TRAVE PRINCIPALE - TRAVE SECONDARIA CON CONNETTORI INCROCIATI GWZ","JOIST-TO-HEADER CONNECTION WITH CROSSED GWZ CONNECTORS","HAUPT-NEBENTRÄGER VERBINDUNG MIT GEKREUZTEN GWZ SCHRAUBEN","CONNEXION POUTRE PRINCIPALE - POUTRE SECONDAIRE AVEC CONNECTEURS GWZ CROISÉES","CONEXIÓN VIGA PRINCIPAL - VIGA SECUNDÁRIA CON CONECTORES GWZ CRUZADOS","LIGAÇÃOVIGA PRINCIPAL / VIGA SECUNDÁRIA COM CONECTORES GWZ CRUZADOS"]
[3,null,"Tecnico Commerciale:","Technical Salesman:","Technischer Verkäufer:","Technico Commercial:","Técnico Comercial:","Técnico Comercial:"]
[4,null,"Progetto:","       Project:","Projekt:","Projet:","Proyecto:","Projeto:"]
[5,null,"Giunzione n°:","Connection n°:","Position:","Connexion no:","Conexión N°:","Ligação n°:"]
[6,null,"Note:","Notes:","Anmerkungen:","Remarques:","Notas:","Notas:"]
[7,null,"Data:","Date:","Datum","Date:","Fecha:","Data:"]
{"$rows_left_out":222}
{"sheet":"DATA","index":4,"n_rows":144,"n_cols":21,"rows_kept":144,"cut":false,"hidden":true,"merged":[[138,5,140,5],[136,5,137,6],[0,10,1,11],[129,4,129,5],[129,6,129,7],[120,11,120,15],[125,11,125,16],[125,3,125,9],[0,13,1,14],[4,7,17,7],[69,0,69,17],[28,0,28,2],[0,0,1,0],[0,1,1,1],[0,2,1,3],[2,7,3,7],[0,5,1,5],[38,1,38,2],[38,3,38,4],[136,7,136,8],[0,6,1,6],[0,4,1,4],[0,7,1,8],[120,6,120,9],[111,2,116,4],[36,17,36,18],[20,0,20,16],[27,17,27,18],[23,17,23,20],[34,17,34,18],[24,17,24,18],[30,17,30,18],[31,17,31,18],[35,17,35,18],[28,17,28,20],[29,17,29,18],[25,17,25,18],[26,17,26,18],[32,17,32,18],[33,17,33,18],[23,0,23,2],[83,0,84,0],[86,6,86,9],[55,1,55,2],[56,1,56,2],[55,3,55,4],[56,3,56,4],[59,0,59,2],[60,1,60,3],[143,0,160,1],[122,0,123,0],[87,1,87,2],[88,1,88,2],[90,1,90,2]]}
["Tendina Norma","Tendina Lingue","Tendina materiale",null,"Tend. cl. serv.","Tendinda durata carico","Tend. nr. coppie","Tendina GWZ",null,null,"Tendina Posizionamento",null,null,"TESTO PER STAMPA PDF"]
[]
["EN 1995:2014-1-1","IT","GL 22c (EN 14080:2013)",null,1,{"$f":"INDEX(TRADUZIONI!$A$2:$H$193,TRADUZIONI!A123,REPORT!$A$4)","v":"Permanente"},1,{"$f":"MATCH(MIN(REPORT!G40,REPORT!G34),DATA!F95:F110,1)","v":8},{"$f":"IF($H$3>=J3,INDEX($B$95:$B$117,J3),\"\")","v":"GWZ6140"},1,{"$f":"INDEX(TRADUZIONI!$A$2:$H$193,TRADUZIONI!A61,REPORT!$A$4)","v":"GWZ interne (al centro della trave)"},null,null,{"$f":"INDEX(TRADUZIONI!$A$2:$H$193,P3,REPORT!$A$4)","v":"Dimensionamento_GWZ"},null,134]
["NTC2018","EN","GL 24c (EN 14080:2013)",null,2,{"$f":"INDEX(TRADUZIONI!$A$2:$H$193,TRADUZIONI!A124,REPORT!$A$4)","v":"Lunga durata"},2,null,{"$f":"IF($H$3>=J4,INDEX($B$95:$B$117,J4),\"\")","v":"GWZ6160"},2,{"$f":"INDEX(TRADUZIONI!$A$2:$H$193,TRADUZIONI!A62,REPORT!$A$4)","v":"GWZ esterne (in prossimità del bordo)"},null,null,{"$f":"INDEX(TRADUZIONI!$A$2:$H$193,P4,REPORT!$A$4)","v":"Disposizione_GWZ"},null,135]
[null,"DE","GL 28c (EN 14080:2013)",null,null,{"$f":"INDEX(TRADUZIONI!$A$2:$H$193,TRADUZIONI!A125,REPORT!$A$4)","v":"Media durata"},3,"Si idfentificano solo i codici idonei in base ad h NT",{"$f":"IF($H$3>=J5,INDEX($B$95:$B$117,J5),\"\")","v":"GWZ6180"},3,null,null,null,{"$f":"INDEX(TRADUZIONI!$A$2:$H$193,P5,REPORT!$A$4)","v":"Il file PDF è stato salvato."},null,136]
[null,"FR","GL 22h (EN 14080:2013)",null,null,{"$f":"INDEX(TRADUZIONI!$A$2:$H$193,TRADUZIONI!A126,REPORT!$A$4)","v":"Breve durata"},null,null,{"$f":"IF($H$3>=J6,INDEX($B$95:$B$117,J6),\"\")","v":"GWZ6200"},4,null,null,null,{"$f":"INDEX(TRADUZIONI!$A$2:$H$193,P6,REPORT!$A$4)","v":"Non è stato possibile salvare il file PDF."},null,137]
[null,"ES","GL 24h (EN 14080:2013)",null,null,{"$f":"INDEX(TRADUZIONI!$A$2:$H$193,TRADUZIONI!A127,REPORT!$A$4)","v":"Istantaneo"},null,null,{"$f":"IF($H$3>=J7,INDEX($B$95:$B$117,J7),\"\")","v":"GWZ8200"},5]
[null,"PT","GL 28h (EN 14080:2013)",null,null,null,null,null,{"$f":"IF($H$3>=J8,INDEX($B$95:$B$117,J8),\"\")","v":"GWZ6220"},6]
{"$rows_left_out":137}
{"sheet":"IMMAGINI","index":5,"n_rows":14,"n_cols":16,"rows_kept":14,"cut":false,"hidden":true,"merged":[]}
[null,null,null,null,null,null,null,null,null,null,{"$f":"TRADUZIONI!C1","v":"Italiano"},{"$f":"TRADUZIONI!D1","v":"English"},{"$f":"TRADUZIONI!E1","v":"Deutsch"},{"$f":"TRADUZIONI!F1","v":"Française"},{"$f":"TRADUZIONI!G1","v":"Español"},{"$f":"TRADUZIONI!H1","v":"Português"}]
[null,null,null,null,null,null,null,null,null,"LINGUE"]
[]
["D45A90F0a",null,null,"D45C1"]
["D45A90F1b",null,null,"D45C2"]
["D45A80F1a",null,null,"D45C3"]
["D45A80F1b"]
["(8 spazi sopra / 8 spazi a destra)"]
{"$rows_left_out":7}
{"sheet":"INFO VERS.","index":6,"n_rows":15,"n_cols":9,"rows_kept":15,"cut":false,"hidden":true,"merged":[]}
[null,"NOTE PER LA COMPILAZIONE:"]
[null,"Ogni modifica va segnata nell'elenco sottostante, andando SEMPRE ad indicare dove e cosa si è modificato"]
[null,"Qualora la modifica comporti un cambio di revisione, la stessa dovrà essere indicata SIA su questo foglio che nel nome del Software che all'inizio di \"LICENSE\" (in automatico si aggiona su \"REPORT\")."]
[]
[]
[null,"VERSIONE","REV.","DATA","MODIFICA","CELLE","RESP","DATA CARICAMENTO PORTALE","Note"]
[null,"vers.1.01","00","2020-07-07","Prima emissione - software reso disponibile a clienti HT (non sul sito)","tutte","CL","2020-09-11"]
[null,"vers.1.02","00","2022-06-15","Integrate le nuove misure di viti GWZ, inserito controllo anche su instabilità e trazione.\nQuesta versione viene caricata direttamente sul nuovo sito HT.","tutte","CL","2022-06-15"]
{"$rows_left_out":7}